FreeBSD-main-amd64-test - Build #24440 - Still Unstable

From: <>
Date: Sat, 25 Nov 2023 06:59:53 UTC
FreeBSD-main-amd64-test - Build #24440 (f72b4f7e149d82ef5b8ed7a3aa415fcd7603b350) - Still Unstable

Build information:
Full change log:
Full build log:

Status explanation:
"Unstable" - some tests are suspected being broken by the following changes
"Still Unstable" - the failing test cases have not been fixed by these
                   following changes and this is a notification to note that
                   these changes have not been fully tested by the CI system

Change summaries:
(Those commits are likely but not certainly responsible)

ac910ad9951a52743389a47fa4a3feabe9021aaa by cy:
rc.d/ldconfig: Remove stray ;;

5622f52c98cda7df1faef11d847e04500158e107 by jhb:
aarch64 nexus: Fix a mismerge in nexus_activate_resource

f72b4f7e149d82ef5b8ed7a3aa415fcd7603b350 by emaste:
etcupdate: temporarily comment out one tzsetup test

The failed test cases:

3 tests failed.
FAILED:  sys.audit.administrative.auditctl_success

Error Message:
Test case cleanup timed out

FAILED:  sys.kqueue.libkqueue.kqueue_test.main

Error Message:
Returned non-success exit status 1

FAILED:  sys.kqueue.proc3_test.proc3

Error Message:
/usr/src/contrib/netbsd-tests/kernel/kqueue/t_proc3.c:89: ke.fflags & NOTE_CHILD not met