FreeBSD-main-amd64-test - Build #24443 - Still Unstable

From: <>
Date: Sat, 25 Nov 2023 22:58:00 UTC
FreeBSD-main-amd64-test - Build #24443 (a9758e46473babc03bfe06edfec35e0c71fa7780) - Still Unstable

Build information:
Full change log:
Full build log:

Status explanation:
"Unstable" - some tests are suspected being broken by the following changes
"Still Unstable" - the failing test cases have not been fixed by these
                   following changes and this is a notification to note that
                   these changes have not been fully tested by the CI system

Change summaries:
(Those commits are likely but not certainly responsible)

d3849ec3c9e700956a8a1d03f7755d586934f225 by kib:
Set installed kernel and driver files access modes using KMODMODE var

a9758e46473babc03bfe06edfec35e0c71fa7780 by kib:
Do not install kernel and modules with executable access bit set

The failed test cases:

3 tests failed.
FAILED:  sys.netpfil.common.dummynet.pf_queue

Error Message:
We failed prioritisation 1 times

FAILED:  sys.audit.administrative.auditctl_success

Error Message:
Test case cleanup timed out

FAILED:  sys.kqueue.proc3_test.proc3

Error Message:
/usr/src/contrib/netbsd-tests/kernel/kqueue/t_proc3.c:89: ke.fflags & NOTE_CHILD not met