FreeBSD-main-amd64-test - Build #23636 - Still Unstable

From: <>
Date: Tue, 30 May 2023 03:05:34 UTC
FreeBSD-main-amd64-test - Build #23636 (8164032a495b53b9176814f7b08e093961fabdca) - Still Unstable

Build information:
Full change log:
Full build log:

Status explanation:
"Unstable" - some tests are suspected being broken by the following changes
"Still Unstable" - the failing test cases have not been fixed by these
                   following changes and this is a notification to note that
                   these changes have not been fully tested by the CI system

Change summaries:
(Those commits are likely but not certainly responsible)

5267120645fa52eac771c9bd8e28d68620a3bb89 by mckusick:
Cleanups to fsck_ffs(8).

6a71277c3037df2c3a70464c2e2bf20dec2c128a by mckusick:
Fix a bug in fsck_ffs(8) triggered by corrupted filesystems.

2c1296a3c5473651aa87eefea25e7b7475e9e16c by kib:
setkey(8): extract prefixlen calculation info helper

2fa1b8617fdf68d0043efb7ae7c524702afba27c by kib:
setkey(8): NAT-T manual configuration support

cf85818e05a9349dfba040fb32e752d3c691ed1f by kib:
setkey(8): document NAT-T and NAT-T MTU extensions syntax

042ec55f9df769697feb6cee472959d001a0f033 by kib:
kern/subr_unit.c: some style

36b1f8a81ef96b42ce446efb79cffd577f1819f7 by kib:
kern/subr_unit.c: more uses for is_bitmap()

d44f477038d3ede5fe62fa19c9301b43455cd8f1 by kib:
subr_unit.c: explain first/last special ranges

f8c37080853c13ada935e7fe3d53286c1d9220f1 by kib:
unr(9): document clean_unrhdr()

f386b27736fe6dee535a530d5c7610d8a9827758 by kib:
unr(9): add 'show unrhdr' ddb command

a014e0a3987a277a0e56c7fa5b9d895f735a8d1e by kib:
unr(9): add iterator interface

c4cc0cab1ea619e07b52ce4c3825e7941996cb49 by kib:
unr(9): add 'show unrhdr_iter' command

12db3c914fe0a985de1e393ee964c9cda5b3e0ca by kib:
unr(9) iterator: add naive test

ea95173dbb3b67019a83155e55f798d4618f18c7 by kib:
unr(9): document iterators

8164032a495b53b9176814f7b08e093961fabdca by kib:
reapkill: handle possible pid reuse after the pid was recorded as

The failed test cases:

4 tests failed.
FAILED:  sys.netpfil.common.dummynet.pf_queue

Error Message:
We failed prioritisation 1 times


Error Message:
atf-check failed; see the output of the test for details


Error Message:
/usr/tests/sys/netlink/ AssertionError


Error Message:
/usr/tests/sys/netlink/ AssertionError