FreeBSD-main-amd64-test - Build #23635 - Still Unstable

From: <>
Date: Tue, 30 May 2023 00:29:18 UTC
FreeBSD-main-amd64-test - Build #23635 (a94018e2003b83c10e8fb814f7a8d47e2513da95) - Still Unstable

Build information:
Full change log:
Full build log:

Status explanation:
"Unstable" - some tests are suspected being broken by the following changes
"Still Unstable" - the failing test cases have not been fixed by these
                   following changes and this is a notification to note that
                   these changes have not been fully tested by the CI system

Change summaries:
(Those commits are likely but not certainly responsible)

d29a9a615c530b50b7f8d5feaa5175f952d8e8e2 by cc:
siftr: fix a build error for powerpc and arm platforms

78914cd641ccf00cc45e720a10dba24927c0a3b8 by cc:
siftr: sync-up man page with recent code changes, and cleanup code

a94018e2003b83c10e8fb814f7a8d47e2513da95 by rmacklem:
nfsuserd: Improve failure message when running in a jail

The failed test cases:

5 tests failed.
FAILED:  sys.fs.fusefs.symlink.main

Error Message:
Returned non-success exit status 1


Error Message:
atf-check failed; see the output of the test for details

FAILED:  sys.fs.fusefs.mknod.main

Error Message:
Returned non-success exit status 1


Error Message:
/usr/tests/sys/netlink/ AssertionError


Error Message:
/usr/tests/sys/netlink/ AssertionError