FreeBSD-main-amd64-test - Build #23634 - Still Unstable

From: <>
Date: Mon, 29 May 2023 21:56:59 UTC
FreeBSD-main-amd64-test - Build #23634 (9d35469e9a6892b3845f66d3513f5c528fe68a77) - Still Unstable

Build information:
Full change log:
Full build log:

Status explanation:
"Unstable" - some tests are suspected being broken by the following changes
"Still Unstable" - the failing test cases have not been fixed by these
                   following changes and this is a notification to note that
                   these changes have not been fully tested by the CI system

Change summaries:
(Those commits are likely but not certainly responsible)

3e7e2bb2467e8bb682176125397168c88c3913c6 by alc:
arm64 pmap: Make VM_PAGE_TO_PV_LIST_LOCK() a constant-time operation

67c802c948abf6955c3d8b53f4a41293a9caea24 by jrm:
libpcap: Update PACKAGE_VERSION definition to 1.10.4

9d35469e9a6892b3845f66d3513f5c528fe68a77 by mhorne:
bcm2835_gpio: Handle BCM2711 pin configuration

The failed test cases:

3 tests failed.
FAILED:  sys.fs.fusefs.mknod.main

Error Message:
Returned non-success exit status 1


Error Message:
/usr/tests/sys/netlink/ AssertionError


Error Message:
/usr/tests/sys/netlink/ AssertionError