FreeBSD-main-amd64-test - Build #23637 - Still Unstable

From: <>
Date: Tue, 30 May 2023 05:49:06 UTC
FreeBSD-main-amd64-test - Build #23637 (d464a7698de8fe18530ea65fac90dce56b860a59) - Still Unstable

Build information:
Full change log:
Full build log:

Status explanation:
"Unstable" - some tests are suspected being broken by the following changes
"Still Unstable" - the failing test cases have not been fixed by these
                   following changes and this is a notification to note that
                   these changes have not been fully tested by the CI system

Change summaries:
(Those commits are likely but not certainly responsible)

d464a7698de8fe18530ea65fac90dce56b860a59 by chs:
ffs: restore backward compatibility of newfs and makefs with older

The failed test cases:

5 tests failed.
FAILED:  sys.fs.fusefs.symlink.main

Error Message:
Returned non-success exit status 1

FAILED:  sys.netpfil.common.dummynet.pf_queue

Error Message:
We failed prioritisation 1 times


Error Message:
atf-check failed; see the output of the test for details


Error Message:
/usr/tests/sys/netlink/ AssertionError


Error Message:
/usr/tests/sys/netlink/ AssertionError