FreeBSD-main-amd64-test - Build #23717 - Still Unstable

From: <>
Date: Mon, 12 Jun 2023 22:35:16 UTC
FreeBSD-main-amd64-test - Build #23717 (34eeabff5a8636155bb02985c5928c1844fd3178) - Still Unstable

Build information:
Full change log:
Full build log:

Status explanation:
"Unstable" - some tests are suspected being broken by the following changes
"Still Unstable" - the failing test cases have not been fixed by these
                   following changes and this is a notification to note that
                   these changes have not been fully tested by the CI system

Change summaries:
(Those commits are likely but not certainly responsible)

694f18d3533c3ca1ba36a3154c74e44662ded809 by markj:
qat: Stop building on i386

266b0663c598b7e50c2998974c16f89b7ac23e3a by markj:
qat: Add IntelĀ® 4xxx Series VF driver support

280826817ff38194cbd7e202e77fc297e5dfdaf3 by markj:
qatfw: Don't build if WITH_SOURCELESS_UCODE is defined

1dd6f95bb90d9c782f2d61dbd33d9803e15e4064 by emaste:
wg(4): add Matt Macy back to AUTHORS section

34eeabff5a8636155bb02985c5928c1844fd3178 by alc:
amd64/arm64 pmap: Stop requiring the accessed bit for superpage

The failed test cases:

4 tests failed.
FAILED:  sys.fs.fusefs.mknod.main

Error Message:
Returned non-success exit status 1

FAILED:  sys.netinet6.frag6.frag6_19.frag6_19

Error Message:
Global IPv6 statistics do not match: 19 != 20


Error Message:
/usr/tests/sys/netlink/ AssertionError


Error Message:
/usr/tests/sys/netlink/ AssertionError