FreeBSD-main-amd64-test - Build #23718 - Still Unstable

From: <>
Date: Tue, 13 Jun 2023 00:54:00 UTC
FreeBSD-main-amd64-test - Build #23718 (0449bc249b78a8c85afe375e581432351f90427d) - Still Unstable

Build information:
Full change log:
Full build log:

Status explanation:
"Unstable" - some tests are suspected being broken by the following changes
"Still Unstable" - the failing test cases have not been fixed by these
                   following changes and this is a notification to note that
                   these changes have not been fully tested by the CI system

Change summaries:
(Those commits are likely but not certainly responsible)

e2cb7201015dbd2d4cea5c9b4e0385d11614263c by mhorne:
mac(4): update the references to MAC modules

0449bc249b78a8c85afe375e581432351f90427d by mhorne:
mac(9): update SEE ALSO

The failed test cases:

4 tests failed.

Error Message:
atf-check failed; see the output of the test for details

FAILED:  sys.netinet6.frag6.frag6_19.frag6_19

Error Message:
Global IPv6 statistics do not match: 19 != 20


Error Message:
/usr/tests/sys/netlink/ AssertionError


Error Message:
/usr/tests/sys/netlink/ AssertionError