FreeBSD-main-amd64-test - Build #23716 - Still Unstable

From: <>
Date: Mon, 12 Jun 2023 19:25:11 UTC
FreeBSD-main-amd64-test - Build #23716 (9c0467929abaab97f45fc07507b6f30c80211239) - Still Unstable

Build information:
Full change log:
Full build log:

Status explanation:
"Unstable" - some tests are suspected being broken by the following changes
"Still Unstable" - the failing test cases have not been fixed by these
                   following changes and this is a notification to note that
                   these changes have not been fully tested by the CI system

Change summaries:
(Those commits are likely but not certainly responsible)

3ed646d89aa4a312ceb1bdcb948f91903860f8f0 by imp:
fix qcom_cpu_kpssv2 compile on ASUS_AC1300

c9a1abe79b826c28c52e42f3f3604d2e4fb96b1a by imp:
mount_nullfs(8): refer to nullfs(5)

a8c1c0b727ef76308ef10b492fa6c25188493f00 by imp:
Add boot1.efi to CLEANFILES

6016aedba1e3701c7c12459effe55e84d7a18b1e by imp:
uipc_syscalls: removed unnecessary check in accept1() function

6f6213ec90e1b5c488cde38f86b4eef09c70c00c by imp:
Add comments for memory size

2c0cd59345cb0aa2e3dd4da5b40e9c40dccd1ffa by imp: Add check for bad email

e74dd9577fb00518834a1bf07fad8c1d4c978d7a by markj:
hwpstate_amd: calculate power if P-state info comes from MSR

718d4a1d5643c2faf409001320c3fd64aae57638 by markj:
opencrypto: Handle end-of-cursor conditions in crypto_cursor_segment()

9f7fdd8c1ab153104275e59b49b2d567cec95256 by markj:
crypto: Advance the correct pointer in crypto_cursor_copydata()

9c0467929abaab97f45fc07507b6f30c80211239 by markj:
geli tests: Add a regression test for PR 271766

The failed test cases:

4 tests failed.

Error Message:
atf-check failed; see the output of the test for details

FAILED:  sys.netinet6.frag6.frag6_19.frag6_19

Error Message:
Global IPv6 statistics do not match: 19 != 20


Error Message:
/usr/tests/sys/netlink/ AssertionError


Error Message:
/usr/tests/sys/netlink/ AssertionError