FreeBSD-main-amd64-test - Build #23713 - Still Unstable

From: <>
Date: Mon, 12 Jun 2023 01:56:00 UTC
FreeBSD-main-amd64-test - Build #23713 (bb5d6d14d81b0789d2e73da03571603426afef56) - Still Unstable

Build information:
Full change log:
Full build log:

Status explanation:
"Unstable" - some tests are suspected being broken by the following changes
"Still Unstable" - the failing test cases have not been fixed by these
                   following changes and this is a notification to note that
                   these changes have not been fully tested by the CI system

Change summaries:
(Those commits are likely but not certainly responsible)

bb5d6d14d81b0789d2e73da03571603426afef56 by cy:
wpa: Enable receiving priority tagged (VID 0) frames

The failed test cases:

4 tests failed.

Error Message:
atf-check failed; see the output of the test for details

FAILED:  sys.netinet6.frag6.frag6_19.frag6_19

Error Message:
Global IPv6 statistics do not match: 19 != 20


Error Message:
/usr/tests/sys/netlink/ AssertionError


Error Message:
/usr/tests/sys/netlink/ AssertionError