FreeBSD-main-amd64-test - Build #23714 - Still Unstable

From: <>
Date: Mon, 12 Jun 2023 12:17:10 UTC
FreeBSD-main-amd64-test - Build #23714 (178747a1586d48a8063014d7b8528ec47205e1bf) - Still Unstable

Build information:
Full change log:
Full build log:

Status explanation:
"Unstable" - some tests are suspected being broken by the following changes
"Still Unstable" - the failing test cases have not been fixed by these
                   following changes and this is a notification to note that
                   these changes have not been fully tested by the CI system

Change summaries:
(Those commits are likely but not certainly responsible)

178747a1586d48a8063014d7b8528ec47205e1bf by andrew:
Add more arm64 special register values

The failed test cases:

3 tests failed.
FAILED:  sys.netinet6.frag6.frag6_19.frag6_19

Error Message:
Global IPv6 statistics do not match: 19 != 20


Error Message:
/usr/tests/sys/netlink/ AssertionError


Error Message:
/usr/tests/sys/netlink/ AssertionError