FreeBSD-main-amd64-test - Build #23712 - Still Unstable

From: <>
Date: Sun, 11 Jun 2023 12:43:58 UTC
FreeBSD-main-amd64-test - Build #23712 (486459056822f080b1ae24600a4c6a7d8ff6f7d6) - Still Unstable

Build information:
Full change log:
Full build log:

Status explanation:
"Unstable" - some tests are suspected being broken by the following changes
"Still Unstable" - the failing test cases have not been fixed by these
                   following changes and this is a notification to note that
                   these changes have not been fully tested by the CI system

Change summaries:
(Those commits are likely but not certainly responsible)

486459056822f080b1ae24600a4c6a7d8ff6f7d6 by dchagin:
Revert "linux(4): The futex_wait operation should restart."

The failed test cases:

4 tests failed.
FAILED:  sys.fs.fusefs.mknod.main

Error Message:
Returned non-success exit status 1

FAILED:  sys.netinet6.frag6.frag6_19.frag6_19

Error Message:
Global IPv6 statistics do not match: 19 != 20


Error Message:
/usr/tests/sys/netlink/ AssertionError


Error Message:
/usr/tests/sys/netlink/ AssertionError