FreeBSD-main-amd64-test - Build #23711 - Still Unstable

From: <>
Date: Sun, 11 Jun 2023 01:59:34 UTC
FreeBSD-main-amd64-test - Build #23711 (51117ed11640e40e877872065ea039e9f97a9cd0) - Still Unstable

Build information:
Full change log:
Full build log:

Status explanation:
"Unstable" - some tests are suspected being broken by the following changes
"Still Unstable" - the failing test cases have not been fixed by these
                   following changes and this is a notification to note that
                   these changes have not been fully tested by the CI system

Change summaries:
(Those commits are likely but not certainly responsible)

3206587a20de9810b549ba8fd0032f7ab884bbec by bz:
LinuxKPI: 802.11: improve scan handling

a5ae63edd59453f23d51a0cc61922bd3e1e4cce4 by bz:
LinuxKPI: 802.11: initialize txq

ab55b58b5c515148e6ef65422c9fda17085f07cd by bz:
LinuxKPI: add dummy of.h

bee50f894b9e0b51668c83e24bf2ec7c275725eb by bz:
LinuxKPI: qcom: update QMI and MHI

51117ed11640e40e877872065ea039e9f97a9cd0 by bz:
LinuxKPI: 802.11: correct HE_MAC_CAP3 values

The failed test cases:

4 tests failed.

Error Message:
atf-check failed; see the output of the test for details

FAILED:  sys.netinet6.frag6.frag6_19.frag6_19

Error Message:
Global IPv6 statistics do not match: 19 != 20


Error Message:
/usr/tests/sys/netlink/ AssertionError


Error Message:
/usr/tests/sys/netlink/ AssertionError