FreeBSD-main-amd64-test - Build #23694 - Still Unstable

From: <>
Date: Thu, 08 Jun 2023 06:35:05 UTC
FreeBSD-main-amd64-test - Build #23694 (1cdec2832d051ddcb1417f3f2601e6212aff2613) - Still Unstable

Build information:
Full change log:
Full build log:

Status explanation:
"Unstable" - some tests are suspected being broken by the following changes
"Still Unstable" - the failing test cases have not been fixed by these
                   following changes and this is a notification to note that
                   these changes have not been fully tested by the CI system

Change summaries:
(Those commits are likely but not certainly responsible)

1cdec2832d051ddcb1417f3f2601e6212aff2613 by jrm:
ndp: Prepare for pending tcpdump update

The failed test cases:

5 tests failed.
FAILED:  sys.netpfil.common.dummynet.pf_queue

Error Message:
We failed prioritisation 1 times

FAILED:  sys.fs.fusefs.symlink.main

Error Message:
Returned non-success exit status 1

FAILED:  sys.netinet6.frag6.frag6_19.frag6_19

Error Message:
Global IPv6 statistics do not match: 19 != 20


Error Message:
/usr/tests/sys/netlink/ AssertionError


Error Message:
/usr/tests/sys/netlink/ AssertionError