FreeBSD-main-amd64-test - Build #23693 - Still Unstable

From: <>
Date: Thu, 08 Jun 2023 04:23:59 UTC
FreeBSD-main-amd64-test - Build #23693 (1232c7884d4a9bc69d4dd71cd293f92bb1ae6197) - Still Unstable

Build information:
Full change log:
Full build log:

Status explanation:
"Unstable" - some tests are suspected being broken by the following changes
"Still Unstable" - the failing test cases have not been fixed by these
                   following changes and this is a notification to note that
                   these changes have not been fully tested by the CI system

Change summaries:
(Those commits are likely but not certainly responsible)

1232c7884d4a9bc69d4dd71cd293f92bb1ae6197 by delphij:
od(1): Fix skip value handling

The failed test cases:

4 tests failed.
FAILED:  sys.fs.fusefs.symlink.main

Error Message:
Returned non-success exit status 1

FAILED:  sys.netinet6.frag6.frag6_19.frag6_19

Error Message:
Global IPv6 statistics do not match: 19 != 20


Error Message:
/usr/tests/sys/netlink/ AssertionError


Error Message:
/usr/tests/sys/netlink/ AssertionError