FreeBSD-main-amd64-test - Build #23692 - Still Unstable

From: <>
Date: Wed, 07 Jun 2023 23:13:53 UTC
FreeBSD-main-amd64-test - Build #23692 (653738e895ba022be1179a95a85089e7bc66dbbe) - Still Unstable

Build information:
Full change log:
Full build log:

Status explanation:
"Unstable" - some tests are suspected being broken by the following changes
"Still Unstable" - the failing test cases have not been fixed by these
                   following changes and this is a notification to note that
                   these changes have not been fully tested by the CI system

Change summaries:
(Those commits are likely but not certainly responsible)

653738e895ba022be1179a95a85089e7bc66dbbe by jhb:
ptrace: Clear TDB_BORN during PT_DETACH.

The failed test cases:

4 tests failed.

Error Message:
atf-check failed; see the output of the test for details

FAILED:  sys.netinet6.frag6.frag6_19.frag6_19

Error Message:
Global IPv6 statistics do not match: 19 != 20


Error Message:
/usr/tests/sys/netlink/ AssertionError


Error Message:
/usr/tests/sys/netlink/ AssertionError