FreeBSD-main-amd64-test - Build #23691 - Still Unstable

From: <>
Date: Wed, 07 Jun 2023 20:24:52 UTC
FreeBSD-main-amd64-test - Build #23691 (aee3611fecba4202c944803b43042ab701dac153) - Still Unstable

Build information:
Full change log:
Full build log:

Status explanation:
"Unstable" - some tests are suspected being broken by the following changes
"Still Unstable" - the failing test cases have not been fixed by these
                   following changes and this is a notification to note that
                   these changes have not been fully tested by the CI system

Change summaries:
(Those commits are likely but not certainly responsible)

aee3611fecba4202c944803b43042ab701dac153 by jhb:
pmcstat: Tweak typo fix.

The failed test cases:

5 tests failed.
FAILED:  sys.fs.fusefs.symlink.main

Error Message:
Returned non-success exit status 1


Error Message:
atf-check failed; see the output of the test for details

FAILED:  sys.netinet6.frag6.frag6_19.frag6_19

Error Message:
Global IPv6 statistics do not match: 19 != 20


Error Message:
/usr/tests/sys/netlink/ AssertionError


Error Message:
/usr/tests/sys/netlink/ AssertionError