FreeBSD-main-amd64-test - Build #23690 - Still Unstable

From: <>
Date: Wed, 07 Jun 2023 17:11:18 UTC
FreeBSD-main-amd64-test - Build #23690 (21f7397a61f7bff61a1221cc6340cd980a922540) - Still Unstable

Build information:
Full change log:
Full build log:

Status explanation:
"Unstable" - some tests are suspected being broken by the following changes
"Still Unstable" - the failing test cases have not been fixed by these
                   following changes and this is a notification to note that
                   these changes have not been fully tested by the CI system

Change summaries:
(Those commits are likely but not certainly responsible)

7a706aad83494fe702c0c97fd85b3b3285ce54a2 by jrtc27:
hwpmc: Update manpage date

296a0987be590e73784e4c313d28a61ff310f1a3 by jrtc27:
pmcstat: Update manpage date

21f7397a61f7bff61a1221cc6340cd980a922540 by jrtc27:
libpmc: Handle PMCALLOCATE log with PMC code on PMU event system

The failed test cases:

4 tests failed.

Error Message:
atf-check failed; see the output of the test for details

FAILED:  sys.netinet6.frag6.frag6_19.frag6_19

Error Message:
Global IPv6 statistics do not match: 19 != 20


Error Message:
/usr/tests/sys/netlink/ AssertionError


Error Message:
/usr/tests/sys/netlink/ AssertionError