FreeBSD-main-amd64-test - Build #23695 - Still Unstable

From: <>
Date: Thu, 08 Jun 2023 08:16:12 UTC
FreeBSD-main-amd64-test - Build #23695 (267411d164d4d38a701599e3afe8d9e9261f65dd) - Still Unstable

Build information:
Full change log:
Full build log:

Status explanation:
"Unstable" - some tests are suspected being broken by the following changes
"Still Unstable" - the failing test cases have not been fixed by these
                   following changes and this is a notification to note that
                   these changes have not been fully tested by the CI system

Change summaries:
(Those commits are likely but not certainly responsible)

267411d164d4d38a701599e3afe8d9e9261f65dd by cperciva:
EC2: Chase awscli package rename

The failed test cases:

4 tests failed.

Error Message:
atf-check failed; see the output of the test for details

FAILED:  sys.netinet6.frag6.frag6_19.frag6_19

Error Message:
Global IPv6 statistics do not match: 19 != 20


Error Message:
/usr/tests/sys/netlink/ AssertionError


Error Message:
/usr/tests/sys/netlink/ AssertionError