FreeBSD-main-amd64-test - Build #23682 - Still Unstable

From: <>
Date: Tue, 06 Jun 2023 13:32:48 UTC
FreeBSD-main-amd64-test - Build #23682 (62f9bcf2b4271d58ccf0bd8a81c540bb99a53ef7) - Still Unstable

Build information:
Full change log:
Full build log:

Status explanation:
"Unstable" - some tests are suspected being broken by the following changes
"Still Unstable" - the failing test cases have not been fixed by these
                   following changes and this is a notification to note that
                   these changes have not been fully tested by the CI system

Change summaries:
(Those commits are likely but not certainly responsible)

62f9bcf2b4271d58ccf0bd8a81c540bb99a53ef7 by andrew:
Switch to contigmalloc in the Hyper-V code

The failed test cases:

3 tests failed.
FAILED:  sys.netinet6.frag6.frag6_19.frag6_19

Error Message:
Global IPv6 statistics do not match: 19 != 20


Error Message:
/usr/tests/sys/netlink/ AssertionError


Error Message:
/usr/tests/sys/netlink/ AssertionError