FreeBSD-main-amd64-test - Build #23681 - Still Unstable

From: <>
Date: Tue, 06 Jun 2023 11:10:44 UTC
FreeBSD-main-amd64-test - Build #23681 (657aec455f7cd960c8fa79a089f88f450c568d2d) - Still Unstable

Build information:
Full change log:
Full build log:

Status explanation:
"Unstable" - some tests are suspected being broken by the following changes
"Still Unstable" - the failing test cases have not been fixed by these
                   following changes and this is a notification to note that
                   these changes have not been fully tested by the CI system

Change summaries:
(Those commits are likely but not certainly responsible)

a9bfd080d09a915055af51103defb5c38b94a236 by kp:
if_epair: do not transmit packets that exceed the interface MTU

185c1cddd7ef34db82bc3a25b3c92556416a4e55 by kp:
netinet: re-read IP length after PFIL hook

657aec455f7cd960c8fa79a089f88f450c568d2d by kp:
pf tests: test reassembly in the slow path

The failed test cases:

4 tests failed.

Error Message:
atf-check failed; see the output of the test for details

FAILED:  sys.netinet6.frag6.frag6_19.frag6_19

Error Message:
Global IPv6 statistics do not match: 19 != 20


Error Message:
/usr/tests/sys/netlink/ AssertionError


Error Message:
/usr/tests/sys/netlink/ AssertionError