FreeBSD-main-amd64-test - Build #23683 - Still Unstable

From: <>
Date: Tue, 06 Jun 2023 16:21:08 UTC
FreeBSD-main-amd64-test - Build #23683 (82aa1470c94c55db31c0168d65f8a08fa1d41378) - Still Unstable

Build information:
Full change log:
Full build log:

Status explanation:
"Unstable" - some tests are suspected being broken by the following changes
"Still Unstable" - the failing test cases have not been fixed by these
                   following changes and this is a notification to note that
                   these changes have not been fully tested by the CI system

Change summaries:
(Those commits are likely but not certainly responsible)

ab1f1aa8333369a83ff284848fc3fc2e52d5f29f by cy:
ntp: import ntp-4.2.8p17

82aa1470c94c55db31c0168d65f8a08fa1d41378 by cy:
ntp: Fix build

The failed test cases:

4 tests failed.
FAILED:  sys.kqueue.libkqueue.kqueue_test.main

Error Message:
Returned non-success exit status 1


Error Message:
atf-check failed; see the output of the test for details


Error Message:
/usr/tests/sys/netlink/ AssertionError


Error Message:
/usr/tests/sys/netlink/ AssertionError