FreeBSD-main-amd64-test - Build #23676 - Still Unstable

From: <>
Date: Mon, 05 Jun 2023 09:53:16 UTC
FreeBSD-main-amd64-test - Build #23676 (9d6ae1e3c26a0c3334a268b587f17dccb9a503d7) - Still Unstable

Build information:
Full change log:
Full build log:

Status explanation:
"Unstable" - some tests are suspected being broken by the following changes
"Still Unstable" - the failing test cases have not been fixed by these
                   following changes and this is a notification to note that
                   these changes have not been fully tested by the CI system

Change summaries:
(Those commits are likely but not certainly responsible)

1e4b7ab136b434dcb296833e509f87c95ac868bc by cperciva:
tslog.h: Wrap in #ifdef _KERNEL

9d6ae1e3c26a0c3334a268b587f17dccb9a503d7 by cperciva:
Revert "Revert "tslog: Annotate some early boot functions""

The failed test cases:

3 tests failed.
FAILED:  sys.netinet6.frag6.frag6_19.frag6_19

Error Message:
Global IPv6 statistics do not match: 19 != 20


Error Message:
/usr/tests/sys/netlink/ AssertionError


Error Message:
/usr/tests/sys/netlink/ AssertionError