FreeBSD-main-amd64-test - Build #23677 - Still Unstable

From: <>
Date: Mon, 05 Jun 2023 16:10:36 UTC
FreeBSD-main-amd64-test - Build #23677 (979754a15ae4c507cd739163331cbaef7b100e23) - Still Unstable

Build information:
Full change log:
Full build log:

Status explanation:
"Unstable" - some tests are suspected being broken by the following changes
"Still Unstable" - the failing test cases have not been fixed by these
                   following changes and this is a notification to note that
                   these changes have not been fully tested by the CI system

Change summaries:
(Those commits are likely but not certainly responsible)

979754a15ae4c507cd739163331cbaef7b100e23 by 0mp:
nfsstat.1: Add a missing argument to -w

The failed test cases:

3 tests failed.
FAILED:  sys.netinet6.frag6.frag6_19.frag6_19

Error Message:
Global IPv6 statistics do not match: 19 != 20


Error Message:
/usr/tests/sys/netlink/ AssertionError


Error Message:
/usr/tests/sys/netlink/ AssertionError