FreeBSD-main-amd64-test - Build #23675 - Still Unstable

From: <>
Date: Mon, 05 Jun 2023 05:12:57 UTC
FreeBSD-main-amd64-test - Build #23675 (37e3f5b23b0720223186f5a00108fdb8d3e88150) - Still Unstable

Build information:
Full change log:
Full build log:

Status explanation:
"Unstable" - some tests are suspected being broken by the following changes
"Still Unstable" - the failing test cases have not been fixed by these
                   following changes and this is a notification to note that
                   these changes have not been fully tested by the CI system

Change summaries:
(Those commits are likely but not certainly responsible)

37e3f5b23b0720223186f5a00108fdb8d3e88150 by delphij:
Enable support for printing 8-byte integers.  For some reason, most of

The failed test cases:

5 tests failed.
FAILED:  sys.fs.fusefs.mknod.main

Error Message:
Returned non-success exit status 1


Error Message:
atf-check failed; see the output of the test for details

FAILED:  sys.netinet6.frag6.frag6_19.frag6_19

Error Message:
Global IPv6 statistics do not match: 19 != 20


Error Message:
/usr/tests/sys/netlink/ AssertionError


Error Message:
/usr/tests/sys/netlink/ AssertionError