FreeBSD-main-amd64-test - Build #23674 - Still Unstable

From: <>
Date: Mon, 05 Jun 2023 03:14:07 UTC
FreeBSD-main-amd64-test - Build #23674 (4d779448adb32ef6424abb781dab87065964d42f) - Still Unstable

Build information:
Full change log:
Full build log:

Status explanation:
"Unstable" - some tests are suspected being broken by the following changes
"Still Unstable" - the failing test cases have not been fixed by these
                   following changes and this is a notification to note that
                   these changes have not been fully tested by the CI system

Change summaries:
(Those commits are likely but not certainly responsible)

4d779448adb32ef6424abb781dab87065964d42f by delphij:
gve: Fix build on i386 and enable LINT builds.

The failed test cases:

3 tests failed.
FAILED:  sys.netinet6.frag6.frag6_19.frag6_19

Error Message:
Global IPv6 statistics do not match: 19 != 20


Error Message:
/usr/tests/sys/netlink/ AssertionError


Error Message:
/usr/tests/sys/netlink/ AssertionError