FreeBSD-main-amd64-test - Build #22898 - Still Unstable

From: <>
Date: Tue, 31 Jan 2023 23:59:04 UTC
FreeBSD-main-amd64-test - Build #22898 (087f0d352ac6e949a51b3e7e0f696d10844e8ada) - Still Unstable

Build information:
Full change log:
Full build log:

Status explanation:
"Unstable" - some tests are suspected being broken by the following changes
"Still Unstable" - the failing test cases have not been fixed by these
                   following changes and this is a notification to note that
                   these changes have not been fully tested by the CI system

Change summaries:
(Those commits are likely but not certainly responsible)

361ac40b0ff6776fb65269c41759abdff6560044 by jhibbits:
IfAPI: Hide the in6m_lookup_locked() implementation.

1bfa548b1f1687f16a738590ee88843ed3c73ae8 by jhibbits:
ifnet/API: Privatize the implementation of the drbr_* APIs

950cc1f44fbd5965db7b679c0aaf1bd9b432ec25 by jhibbits:
bpf: Add "_if" tap APIs

113af4fd2bcb464307daf8ca053dc728db8da61d by jhibbits:
IfAPI: Add if_gettype() API and use it for vlan

30af2c131bb05528f9b14518a7ed3e98c590b55e by jhibbits:
IfAPI: Add if_get/setmaclabel() and use it.

3d0d5b21c9b2cfd7e48209340a090f63ca4bce03 by jhibbits:
IfAPI: Explicitly include <net/if_private.h> in netstack

c255d1a401c7ed736ba6bb7894deda584356bfaf by jhibbits:
IfAPI: Add if_llsoftc member accessors for TOEDEV

9507d03bfe029c61f78854ed8579bda0e5620982 by jhibbits:
IfAPI: Use the ifnet APIs in kern_poll()

0d2684e15e415cef652e0f75e88962a674bffe04 by jhibbits:
IfAPI: Add some more accessors

31cfaf191b0861d54ce8e212c77b458fd8fc018e by jhibbits:
IfAPI: Add l2com accessor for firewire.

d79539e6f2eea0d659b1a96e0447e2fa9e2122fa by jhibbits:
IfAPI: Add if_altq_is_enabled() interface.

4519a073c326bf84a3618e3d66b0f11dc5906851 by jhibbits:
Mechanically convert if_re(4) to DrvAPI

56c1eafe50e19e31cc30c3aa7fa90fc9f246e289 by jhibbits:
IfAPI: Finish conversion of bnxt(4) to IfAPI.

087f0d352ac6e949a51b3e7e0f696d10844e8ada by jhibbits:
Mechanically convert bge(4) to DrvAPI

The failed test cases:

5 tests failed.
FAILED:  libexec.tftpd.functional.dotdot_v4

Error Message:
Test case body timed out

FAILED:  libexec.tftpd.functional.wrq_eaccess_world_readable_v4

Error Message:
Test case body timed out

FAILED:  sys.aio.aio_test.aio_socket_blocking_short_write

Error Message:
Test case body timed out

FAILED:  sys.aio.aio_test.aio_socket_blocking_short_write_vectored

Error Message:
Test case body timed out

FAILED:  sys.aio.aio_test.aio_socket_short_write_cancel

Error Message:
/usr/src/tests/sys/aio/aio_test.c:1396: aio_error(&iocb) == EINPROGRESS not met