FreeBSD-main-amd64-test - Build #22899 - Still Unstable

From: <>
Date: Wed, 01 Feb 2023 01:55:42 UTC
FreeBSD-main-amd64-test - Build #22899 (b0ddb44fd427d44b8153781ce9c461e393771aff) - Still Unstable

Build information:
Full change log:
Full build log:

Status explanation:
"Unstable" - some tests are suspected being broken by the following changes
"Still Unstable" - the failing test cases have not been fixed by these
                   following changes and this is a notification to note that
                   these changes have not been fully tested by the CI system

Change summaries:
(Those commits are likely but not certainly responsible)

34d5a6a3dc6b8a29499b4723168d7450b17dfd01 by jhibbits:
Last change for mgb(4) needed for IfAPI conversion

74c592c047133cc6cecd7bbf5287dd285868c1b0 by jhibbits:
etherswitch: Clean up whitespace after IfAPI conversion

ad06fc328365fc7fff9c8adee43ad798a6c6a73e by jhibbits:
re(4): Fix whitespace from IfAPI conversion

b7459fb0adaf05268b5da9a8772a4fb0250bba65 by jhibbits:
Mechanically convert genet(4) to IfAPI

98fe10c8fc08df95937af51856f5b77ff470cc3a by jhibbits:
Mechanically convert mge(4) to IfAPI

44e65355a35b99812a9655b31f2f54aed6d79292 by jhibbits:
Mechanically convert if_cas(4) to IfAPI

3df047e3f3f88f5b108a53fae11c9ab9a97a4df7 by jhibbits:
Mechanically convert ps3 if_glc(4) to IfAPI

9f012efb63cbe4fbcce1c58336d7fc97830650f8 by jhibbits:
Mechanically convert gem(4) to IfAPI

13f2ef1637bc7da1e96253722afe42435fb37c59 by jhibbits:
Mechanically convert mwl(4) to IfAPI

dc57ec3ca0fbd11d351a4ca1e305a29dd1dc74f5 by jhibbits:
Mechanically convert ffec(4) to IfAPI

53545967642d850eee4f2dd9fa27cae52ae981b9 by erj:
vtd: Increase DRHD_MAX_UNITS

a83b3ec719eb6c53658656b7b90607564d3c64d3 by dumbbell:
linuxkpi: list_sort()'s callback now takes list arguments

3dd980267f4e53df259eb6d322e7332a8bc5bb0a by bz:
LinuxKPI: 802.11: enhance lkpi_scan_ies_add() for HT and VHT

b0ddb44fd427d44b8153781ce9c461e393771aff by bz:
LinuxKPI: 802.11: fix indent in lkpi_wake_tx_queues()

The failed test cases:

3 tests failed.
FAILED:  sys.aio.aio_test.aio_socket_blocking_short_write

Error Message:
Test case body timed out

FAILED:  sys.aio.aio_test.aio_socket_blocking_short_write_vectored

Error Message:
Test case body timed out

FAILED:  sys.aio.aio_test.aio_socket_short_write_cancel

Error Message:
/usr/src/tests/sys/aio/aio_test.c:1396: aio_error(&iocb) == EINPROGRESS not met