FreeBSD-main-amd64-test - Build #22897 - Still Unstable

From: <>
Date: Tue, 31 Jan 2023 22:16:19 UTC
FreeBSD-main-amd64-test - Build #22897 (537c166b767879398338370701fa60f67acec112) - Still Unstable

Build information:
Full change log:
Full build log:

Status explanation:
"Unstable" - some tests are suspected being broken by the following changes
"Still Unstable" - the failing test cases have not been fixed by these
                   following changes and this is a notification to note that
                   these changes have not been fully tested by the CI system

Change summaries:
(Those commits are likely but not certainly responsible)

7738bb89a3cc70dc83ed4e80ee5160c18a7721f3 by mhorne:
elf_common.h: remove obsolete riscv relocations

537c166b767879398338370701fa60f67acec112 by mhorne:
elftoolchain: update the list of riscv relocations

The failed test cases:

4 tests failed.

Error Message:
/usr/local/lib/python3.9/multiprocessing/ EOFError

FAILED:  sys.aio.aio_test.aio_socket_blocking_short_write

Error Message:
Test case body timed out

FAILED:  sys.aio.aio_test.aio_socket_blocking_short_write_vectored

Error Message:
Test case body timed out

FAILED:  sys.aio.aio_test.aio_socket_short_write_cancel

Error Message:
/usr/src/tests/sys/aio/aio_test.c:1396: aio_error(&iocb) == EINPROGRESS not met