FreeBSD-main-amd64-test - Build #22896 - Still Unstable

From: <>
Date: Tue, 31 Jan 2023 19:55:28 UTC
FreeBSD-main-amd64-test - Build #22896 (3d100b2a5a3694f5f6405bd2f4fdce3ca302171e) - Still Unstable

Build information:
Full change log:
Full build log:

Status explanation:
"Unstable" - some tests are suspected being broken by the following changes
"Still Unstable" - the failing test cases have not been fixed by these
                   following changes and this is a notification to note that
                   these changes have not been fully tested by the CI system

Change summaries:
(Those commits are likely but not certainly responsible)

5a9a0d7803382321b5f9fff1deae5fb08463cf1a by bz:
LinuxKPI: 802.11: basic implementation of *queue(s)/*txq*

ff76cbc81d57ffc4bbc9bc20fd22325b2a8c2028 by bz:
LinuxKPI: 802.11: implement ieee80211_is_pspoll()

69759b0c695da15a3379ca01335ab314897d8594 by jhibbits:
Remove dme(4).

2336248a8ba9763ad38074db40f32e117edd86f5 by bz:
LinuxKPI: 802.11: fix ff76cbc81d57ffc4bbc9bc20fd22325b2a8c2028 (pspoll)

3d100b2a5a3694f5f6405bd2f4fdce3ca302171e by jhibbits:
Remove dme(4) from files

The failed test cases:

4 tests failed.
FAILED:  sys.fs.fusefs.mknod.main

Error Message:
Returned non-success exit status 1

FAILED:  sys.aio.aio_test.aio_socket_blocking_short_write

Error Message:
Test case body timed out

FAILED:  sys.aio.aio_test.aio_socket_blocking_short_write_vectored

Error Message:
Test case body timed out

FAILED:  sys.aio.aio_test.aio_socket_short_write_cancel

Error Message:
/usr/src/tests/sys/aio/aio_test.c:1396: aio_error(&iocb) == EINPROGRESS not met