FreeBSD-main-amd64-test - Build #22895 - Still Unstable

From: <>
Date: Tue, 31 Jan 2023 17:54:51 UTC
FreeBSD-main-amd64-test - Build #22895 (a839757109891573123d8777b539fafa2d2198bb) - Still Unstable

Build information:
Full change log:
Full build log:

Status explanation:
"Unstable" - some tests are suspected being broken by the following changes
"Still Unstable" - the failing test cases have not been fixed by these
                   following changes and this is a notification to note that
                   these changes have not been fully tested by the CI system

Change summaries:
(Those commits are likely but not certainly responsible)

e80699a809a079c4e673940544d6ddd944e8d08e by melifaro:
netlink: add NETLINK to GENERIC.

e30e05d3ab3979a148068235298e1a6f73b675f0 by bz:
LinuxKPI: 802.11: extend linuxkpi_ieee80211_rx()

a839757109891573123d8777b539fafa2d2198bb by bz:
LinuxKPI: 802.11: implement ieee80211_tx_status_ext()

The failed test cases:

3 tests failed.
FAILED:  sys.aio.aio_test.aio_socket_blocking_short_write

Error Message:
Test case body timed out

FAILED:  sys.aio.aio_test.aio_socket_blocking_short_write_vectored

Error Message:
Test case body timed out

FAILED:  sys.aio.aio_test.aio_socket_short_write_cancel

Error Message:
/usr/src/tests/sys/aio/aio_test.c:1396: aio_error(&iocb) == EINPROGRESS not met