FreeBSD-main-amd64-test - Build #22758 - Still Unstable

From: <>
Date: Sat, 07 Jan 2023 01:26:27 UTC
FreeBSD-main-amd64-test - Build #22758 (da303f5fd4ee8582cf76712212dd0b711d7d9dac) - Still Unstable

Build information:
Full change log:
Full build log:

Status explanation:
"Unstable" - some tests are suspected being broken by the following changes
"Still Unstable" - the failing test cases have not been fixed by these
                   following changes and this is a notification to note that
                   these changes have not been fully tested by the CI system

Change summaries:
(Those commits are likely but not certainly responsible)

0b4531511ead79951918e9e7b58937f6a8b59fd8 by emaste:
copyright: chase my name and email change

da303f5fd4ee8582cf76712212dd0b711d7d9dac by asomers:
fsx: more consistent debug output with -[RWU]

The failed test cases:

4 tests failed.
FAILED:  usr.sbin.etcupdate.preworld_test.main

Error Message:
Returned non-success exit status 1

FAILED:  sys.aio.aio_test.aio_socket_blocking_short_write

Error Message:
Test case body timed out

FAILED:  sys.aio.aio_test.aio_socket_blocking_short_write_vectored

Error Message:
Test case body timed out

FAILED:  sys.aio.aio_test.aio_socket_short_write_cancel

Error Message:
/usr/src/tests/sys/aio/aio_test.c:1396: aio_error(&iocb) == EINPROGRESS not met