FreeBSD-main-amd64-test - Build #22759 - Still Unstable

From: <>
Date: Sat, 07 Jan 2023 04:13:44 UTC
FreeBSD-main-amd64-test - Build #22759 (5cf20707ba79b5c06b26381da0013c65004b53be) - Still Unstable

Build information:
Full change log:
Full build log:

Status explanation:
"Unstable" - some tests are suspected being broken by the following changes
"Still Unstable" - the failing test cases have not been fixed by these
                   following changes and this is a notification to note that
                   these changes have not been fully tested by the CI system

Change summaries:
(Those commits are likely but not certainly responsible)

97e1430606f8387c03fe6e544005be8dab6a3364 by imp:
stand: Add inttype.h

5cf20707ba79b5c06b26381da0013c65004b53be by imp:
stand: Allow stand.h to be included in C++ programs

The failed test cases:

4 tests failed.
FAILED:  usr.sbin.etcupdate.preworld_test.main

Error Message:
Returned non-success exit status 1

FAILED:  sys.aio.aio_test.aio_socket_blocking_short_write

Error Message:
Test case body timed out

FAILED:  sys.aio.aio_test.aio_socket_blocking_short_write_vectored

Error Message:
Test case body timed out

FAILED:  sys.aio.aio_test.aio_socket_short_write_cancel

Error Message:
/usr/src/tests/sys/aio/aio_test.c:1396: aio_error(&iocb) == EINPROGRESS not met