FreeBSD-main-amd64-test - Build #22757 - Still Unstable

From: <>
Date: Fri, 06 Jan 2023 23:18:53 UTC
FreeBSD-main-amd64-test - Build #22757 (c3ca3fa7d34fdce1c780eefb4ab212db0df9377d) - Still Unstable

Build information:
Full change log:
Full build log:

Status explanation:
"Unstable" - some tests are suspected being broken by the following changes
"Still Unstable" - the failing test cases have not been fixed by these
                   following changes and this is a notification to note that
                   these changes have not been fully tested by the CI system

Change summaries:
(Those commits are likely but not certainly responsible)

29bfaf1c6d8bc0a06aaa7e09363544769eade3c0 by kib:
i386: print trampoline disposition value for verbose boot

638937d466648a9e5733225aef62eeae02db4f03 by grembo:
asmc: Add support for MacBook5,5

13214c601a49d733bd17d42b927788bb9feea536 by melifaro:
netlink: fix ifaddr reporting.

c3ca3fa7d34fdce1c780eefb4ab212db0df9377d by glebius:
tests: add test for ipfw fwd localaddr,port

The failed test cases:

4 tests failed.
FAILED:  usr.sbin.etcupdate.preworld_test.main

Error Message:
Returned non-success exit status 1

FAILED:  sys.aio.aio_test.aio_socket_blocking_short_write

Error Message:
Test case body timed out

FAILED:  sys.aio.aio_test.aio_socket_blocking_short_write_vectored

Error Message:
Test case body timed out

FAILED:  sys.aio.aio_test.aio_socket_short_write_cancel

Error Message:
/usr/src/tests/sys/aio/aio_test.c:1396: aio_error(&iocb) == EINPROGRESS not met