FreeBSD-main-amd64-test - Build #22756 - Still Unstable

From: <>
Date: Fri, 06 Jan 2023 20:57:20 UTC
FreeBSD-main-amd64-test - Build #22756 (3f8ca7a22ed917a3e3a4ad78538d9f468d6d3bd8) - Still Unstable

Build information:
Full change log:
Full build log:

Status explanation:
"Unstable" - some tests are suspected being broken by the following changes
"Still Unstable" - the failing test cases have not been fixed by these
                   following changes and this is a notification to note that
                   these changes have not been fully tested by the CI system

Change summaries:
(Those commits are likely but not certainly responsible)

c728c97f5c838c9a873516c4499e4e1a41788ce7 by cy:
sqlite3: Vendor import of sqlite3 3.40.0

3f8ca7a22ed917a3e3a4ad78538d9f468d6d3bd8 by asomers:
fsx: bounds check the inputs

The failed test cases:

4 tests failed.
FAILED:  usr.sbin.etcupdate.preworld_test.main

Error Message:
Returned non-success exit status 1

FAILED:  sys.aio.aio_test.aio_socket_blocking_short_write

Error Message:
Test case body timed out

FAILED:  sys.aio.aio_test.aio_socket_blocking_short_write_vectored

Error Message:
Test case body timed out

FAILED:  sys.aio.aio_test.aio_socket_short_write_cancel

Error Message:
/usr/src/tests/sys/aio/aio_test.c:1396: aio_error(&iocb) == EINPROGRESS not met