FreeBSD-main-amd64-test - Build #22733 - Still Unstable

From: <>
Date: Mon, 02 Jan 2023 21:17:31 UTC
FreeBSD-main-amd64-test - Build #22733 (e3e57edf4aac05d041ca55ff2f008c6109ef88d5) - Still Unstable

Build information:
Full change log:
Full build log:

Status explanation:
"Unstable" - some tests are suspected being broken by the following changes
"Still Unstable" - the failing test cases have not been fixed by these
                   following changes and this is a notification to note that
                   these changes have not been fully tested by the CI system

Change summaries:
(Those commits are likely but not certainly responsible)

fef0e429f190d396d5b3228166a012e85dd912f2 by cy:
network.subr: Replace "\ " with "[[:space:]]"

87061d3bffd1becd643b0ba9dc6f0a7699efbb39 by cy:
network.subr: Add missing brace

e3e57edf4aac05d041ca55ff2f008c6109ef88d5 by cy:
network.subr: Fix infinite loop

The failed test cases:

4 tests failed.
FAILED:  sys.netinet6.lpm6.lpm6_test2_success

Error Message:
atf-check failed; see the output of the test for details

FAILED:  sys.aio.aio_test.aio_socket_blocking_short_write

Error Message:
Test case body timed out

FAILED:  sys.aio.aio_test.aio_socket_blocking_short_write_vectored

Error Message:
Test case body timed out

FAILED:  sys.aio.aio_test.aio_socket_short_write_cancel

Error Message:
/usr/src/tests/sys/aio/aio_test.c:1396: aio_error(&iocb) == EINPROGRESS not met