FreeBSD-main-amd64-test - Build #22732 - Still Unstable

From: <>
Date: Mon, 02 Jan 2023 08:22:16 UTC
FreeBSD-main-amd64-test - Build #22732 (a1f28ec729f7491da8607e8eeaee1b0f547c60d0) - Still Unstable

Build information:
Full change log:
Full build log:

Status explanation:
"Unstable" - some tests are suspected being broken by the following changes
"Still Unstable" - the failing test cases have not been fixed by these
                   following changes and this is a notification to note that
                   these changes have not been fully tested by the CI system

Change summaries:
(Those commits are likely but not certainly responsible)

a1f28ec729f7491da8607e8eeaee1b0f547c60d0 by nyan:
unzip: Document optional member list

The failed test cases:

4 tests failed.

Error Message:
/usr/local/lib/python3.9/multiprocessing/ EOFError

FAILED:  sys.aio.aio_test.aio_socket_blocking_short_write

Error Message:
Test case body timed out

FAILED:  sys.aio.aio_test.aio_socket_blocking_short_write_vectored

Error Message:
Test case body timed out

FAILED:  sys.aio.aio_test.aio_socket_short_write_cancel

Error Message:
/usr/src/tests/sys/aio/aio_test.c:1396: aio_error(&iocb) == EINPROGRESS not met