FreeBSD-main-amd64-test - Build #22734 - Still Unstable

From: <>
Date: Tue, 03 Jan 2023 00:14:46 UTC
FreeBSD-main-amd64-test - Build #22734 (17f2b12a3877f460f72123242c068881806388c2) - Still Unstable

Build information:
Full change log:
Full build log:

Status explanation:
"Unstable" - some tests are suspected being broken by the following changes
"Still Unstable" - the failing test cases have not been fixed by these
                   following changes and this is a notification to note that
                   these changes have not been fully tested by the CI system

Change summaries:
(Those commits are likely but not certainly responsible)

8dfb5571c4d88b2320407968b14590aa80b44fb3 by dumbbell:
linuxkpi: Include `errno.h` from `acpi/video.h`

17f2b12a3877f460f72123242c068881806388c2 by dumbbell:
linuxkpi: Define `lockdep_assert_none_held_once()`

The failed test cases:

4 tests failed.
FAILED:  sys.netinet6.lpm6.lpm6_test2_success

Error Message:
atf-check failed; see the output of the test for details

FAILED:  sys.aio.aio_test.aio_socket_blocking_short_write

Error Message:
Test case body timed out

FAILED:  sys.aio.aio_test.aio_socket_blocking_short_write_vectored

Error Message:
Test case body timed out

FAILED:  sys.aio.aio_test.aio_socket_short_write_cancel

Error Message:
/usr/src/tests/sys/aio/aio_test.c:1396: aio_error(&iocb) == EINPROGRESS not met