FreeBSD-main-amd64-test - Build #23447 - Still Unstable

From: <>
Date: Sat, 29 Apr 2023 01:47:35 UTC
FreeBSD-main-amd64-test - Build #23447 (b347c22846038a070ea576e904771178acf5a302) - Still Unstable

Build information:
Full change log:
Full build log:

Status explanation:
"Unstable" - some tests are suspected being broken by the following changes
"Still Unstable" - the failing test cases have not been fixed by these
                   following changes and this is a notification to note that
                   these changes have not been fully tested by the CI system

Change summaries:
(Those commits are likely but not certainly responsible)

b347c22846038a070ea576e904771178acf5a302 by arichardson:
cross-build: Add common compatibility headers after OS-specific ones

The failed test cases:

3 tests failed.
FAILED:  sys.netinet6.ndp.ndp_del_gu_success

Error Message:
atf-check failed; see the output of the test for details

FAILED:  sys.file.path_test.path_pipe_fstatat

Error Message:
/usr/src/tests/sys/file/path_test.c:851: fstatat pipe: Not a directory

FAILED:  sys.netlink.test_snl.snl_parse_errmsg_capped

Error Message:
1 checks failed; see output for more details