FreeBSD-main-amd64-test - Build #23446 - Still Unstable

From: <>
Date: Fri, 28 Apr 2023 23:59:09 UTC
FreeBSD-main-amd64-test - Build #23446 (67633329693723734aef003044e13db07f1fbf5f) - Still Unstable

Build information:
Full change log:
Full build log:

Status explanation:
"Unstable" - some tests are suspected being broken by the following changes
"Still Unstable" - the failing test cases have not been fixed by these
                   following changes and this is a notification to note that
                   these changes have not been fully tested by the CI system

Change summaries:
(Those commits are likely but not certainly responsible)

c21d87a88c72804bc4fb86d7b0e8a846230e4ad0 by kib:
vfs: vn_dir_next_dirent(): Adapt comments to style(9)

2544b8e00ca1afea64b00a6ddaf7b584244ade90 by kib:
vfs: Rename vfs_emptydir() to vn_dir_check_empty()

d43bf55fc5457dd0b95f19ebbffcc8d8501ea157 by manu:
armv7: Fix BeagleBone Black panic on system start

e133103ab6b35d96d06f24825cff6caa298f595a by ambrisko:
mrsas(4) fix build on targets that don't define PTRIN.

67633329693723734aef003044e13db07f1fbf5f by ambrisko:
mrsas(4) switch from PTRIN define to include sys/abi_compat.h

The failed test cases:

3 tests failed.
FAILED:  sys.netpfil.common.dummynet.pf_queue

Error Message:
We failed prioritisation 1 times

FAILED:  sys.file.path_test.path_pipe_fstatat

Error Message:
/usr/src/tests/sys/file/path_test.c:851: fstatat pipe: Not a directory

FAILED:  sys.netlink.test_snl.snl_parse_errmsg_capped

Error Message:
1 checks failed; see output for more details