FreeBSD-main-amd64-test - Build #23448 - Still Unstable

From: <>
Date: Sat, 29 Apr 2023 14:18:56 UTC
FreeBSD-main-amd64-test - Build #23448 (fef74e99fc234a687f1a00318ece1834587c4e92) - Still Unstable

Build information:
Full change log:
Full build log:

Status explanation:
"Unstable" - some tests are suspected being broken by the following changes
"Still Unstable" - the failing test cases have not been fixed by these
                   following changes and this is a notification to note that
                   these changes have not been fully tested by the CI system

Change summaries:
(Those commits are likely but not certainly responsible)

fef74e99fc234a687f1a00318ece1834587c4e92 by ceri:
setfacl.1: correct reference to a trailing comma, should read "colon"

The failed test cases:

3 tests failed.
FAILED:  sys.fs.fusefs.mknod.main

Error Message:
Returned non-success exit status 1

FAILED:  sys.file.path_test.path_pipe_fstatat

Error Message:
/usr/src/tests/sys/file/path_test.c:851: fstatat pipe: Not a directory

FAILED:  sys.netlink.test_snl.snl_parse_errmsg_capped

Error Message:
1 checks failed; see output for more details