FreeBSD-main-amd64-test - Build #22717 - Still Unstable

From: <>
Date: Fri, 30 Dec 2022 12:42:50 UTC
FreeBSD-main-amd64-test - Build #22717 (a5ff86646ee4602a141a24eee95c1c60bb375030) - Still Unstable

Build information:
Full change log:
Full build log:

Status explanation:
"Unstable" - some tests are suspected being broken by the following changes
"Still Unstable" - the failing test cases have not been fixed by these
                   following changes and this is a notification to note that
                   these changes have not been fully tested by the CI system

Change summaries:
(Those commits are likely but not certainly responsible)

a5ff86646ee4602a141a24eee95c1c60bb375030 by kib:
UFSSUSPEND: unbusy mp in EDADLK case

The failed test cases:

5 tests failed.

Error Message:
/usr/tests/atf_python/sys/net/ IndexError

FAILED:  sys.netpfil.common.dummynet.pf_queue

Error Message:
We failed prioritisation 1 times

FAILED:  sys.aio.aio_test.aio_socket_blocking_short_write

Error Message:
Test case body timed out

FAILED:  sys.aio.aio_test.aio_socket_blocking_short_write_vectored

Error Message:
Test case body timed out

FAILED:  sys.aio.aio_test.aio_socket_short_write_cancel

Error Message:
/usr/src/tests/sys/aio/aio_test.c:1396: aio_error(&iocb) == EINPROGRESS not met