FreeBSD-main-amd64-test - Build #22716 - Still Unstable

From: <>
Date: Fri, 30 Dec 2022 01:11:36 UTC
FreeBSD-main-amd64-test - Build #22716 (701b36961cbd2084c36eb828402d0ef89211d929) - Still Unstable

Build information:
Full change log:
Full build log:

Status explanation:
"Unstable" - some tests are suspected being broken by the following changes
"Still Unstable" - the failing test cases have not been fixed by these
                   following changes and this is a notification to note that
                   these changes have not been fully tested by the CI system

Change summaries:
(Those commits are likely but not certainly responsible)

37b9fb169686e867987c8a1a9868f81137b9df2b by kib:
Add descrip_check_write_mp() helper

68912701700ca3230f3e2d4b7858a038f884a327 by kib:
ffs_suspend.c: clean up includes

701b36961cbd2084c36eb828402d0ef89211d929 by kib:
ufs/suspend: deny suspension if the calling process has a file from mp

The failed test cases:

5 tests failed.
FAILED:  libexec.tftpd.functional.wrq_eaccess_v6

Error Message:
Test case body timed out

FAILED:  sys.netinet6.ndp.ndp_del_gu_success

Error Message:
atf-check failed; see the output of the test for details

FAILED:  sys.aio.aio_test.aio_socket_blocking_short_write

Error Message:
Test case body timed out

FAILED:  sys.aio.aio_test.aio_socket_blocking_short_write_vectored

Error Message:
Test case body timed out

FAILED:  sys.aio.aio_test.aio_socket_short_write_cancel

Error Message:
/usr/src/tests/sys/aio/aio_test.c:1396: aio_error(&iocb) == EINPROGRESS not met