FreeBSD-main-amd64-test - Build #22715 - Still Unstable

From: <>
Date: Thu, 29 Dec 2022 23:24:48 UTC
FreeBSD-main-amd64-test - Build #22715 (4ac8f4067096a9d4a00e41cd53bd5c4fa295fd15) - Still Unstable

Build information:
Full change log:
Full build log:

Status explanation:
"Unstable" - some tests are suspected being broken by the following changes
"Still Unstable" - the failing test cases have not been fixed by these
                   following changes and this is a notification to note that
                   these changes have not been fully tested by the CI system

Change summaries:
(Those commits are likely but not certainly responsible)

7063b9974f8a39d860b7abd03884324e71994f65 by jhb:
ccr: Retire ccr_softc member in struct adapter.

f63825ff21a3bee2630ea8b0ed27a4583cc4242b by melifaro:
testing: improve python vnet wrapper.

4ac8f4067096a9d4a00e41cd53bd5c4fa295fd15 by syrinx:
Follow the standard object definition from RFC2578

The failed test cases:

3 tests failed.
FAILED:  sys.aio.aio_test.aio_socket_blocking_short_write

Error Message:
Test case body timed out

FAILED:  sys.aio.aio_test.aio_socket_blocking_short_write_vectored

Error Message:
Test case body timed out

FAILED:  sys.aio.aio_test.aio_socket_short_write_cancel

Error Message:
/usr/src/tests/sys/aio/aio_test.c:1396: aio_error(&iocb) == EINPROGRESS not met