FreeBSD-main-amd64-test - Build #22714 - Still Unstable

From: <>
Date: Thu, 29 Dec 2022 05:24:07 UTC
FreeBSD-main-amd64-test - Build #22714 (f3c043bb5fa2b30d4119c2e68fb1e7cd56deffd4) - Still Unstable

Build information:
Full change log:
Full build log:

Status explanation:
"Unstable" - some tests are suspected being broken by the following changes
"Still Unstable" - the failing test cases have not been fixed by these
                   following changes and this is a notification to note that
                   these changes have not been fully tested by the CI system

Change summaries:
(Those commits are likely but not certainly responsible)

f45feecfb27ca51067d6789eaa43547cadc4990b by mjg:
vfs: add vn_getsize

43dc1409c139c39056bafdcd4d083230ccb10b50 by obrien:
Restricting xargs to '-n1' is much slower and isn't needed for file(1)

96c6fba6fdc1bfaa138507365a52e7961811c9d6 by obrien:
rc.subr: Minor formatting fix for ac102a2a6

bb6266f279c0310d191b63ccdb60489b57c76df7 by obrien:
newsyslog.conf: Sort paths

f3c043bb5fa2b30d4119c2e68fb1e7cd56deffd4 by obrien:
newsyslog.conf: Minor formatting fix

The failed test cases:

3 tests failed.
FAILED:  sys.aio.aio_test.aio_socket_blocking_short_write

Error Message:
Test case body timed out

FAILED:  sys.aio.aio_test.aio_socket_blocking_short_write_vectored

Error Message:
Test case body timed out

FAILED:  sys.aio.aio_test.aio_socket_short_write_cancel

Error Message:
/usr/src/tests/sys/aio/aio_test.c:1396: aio_error(&iocb) == EINPROGRESS not met