FreeBSD-main-amd64-test - Build #22718 - Still Unstable

From: <>
Date: Fri, 30 Dec 2022 18:23:14 UTC
FreeBSD-main-amd64-test - Build #22718 (1522062bade29c973c152303005a31a578f090d9) - Still Unstable

Build information:
Full change log:
Full build log:

Status explanation:
"Unstable" - some tests are suspected being broken by the following changes
"Still Unstable" - the failing test cases have not been fixed by these
                   following changes and this is a notification to note that
                   these changes have not been fully tested by the CI system

Change summaries:
(Those commits are likely but not certainly responsible)

1522062bade29c973c152303005a31a578f090d9 by wulf:
hidraw(4): Drop unneeded usb kernel module dependency

The failed test cases:

3 tests failed.
FAILED:  sys.aio.aio_test.aio_socket_blocking_short_write

Error Message:
Test case body timed out

FAILED:  sys.aio.aio_test.aio_socket_blocking_short_write_vectored

Error Message:
Test case body timed out

FAILED:  sys.aio.aio_test.aio_socket_short_write_cancel

Error Message:
/usr/src/tests/sys/aio/aio_test.c:1396: aio_error(&iocb) == EINPROGRESS not met