FreeBSD-main-amd64-test - Build #22699 - Still Unstable

From: <>
Date: Sat, 24 Dec 2022 19:38:22 UTC
FreeBSD-main-amd64-test - Build #22699 (eda82511883f540cd18f8afd2268636c7db97685) - Still Unstable

Build information:
Full change log:
Full build log:

Status explanation:
"Unstable" - some tests are suspected being broken by the following changes
"Still Unstable" - the failing test cases have not been fixed by these
                   following changes and this is a notification to note that
                   these changes have not been fully tested by the CI system

Change summaries:
(Those commits are likely but not certainly responsible)

3da494d3246e30a19d2107c8bb8a293ffd5a9da6 by vmaffione:
netmap: drop compatibility FreeBSD code

b41818a28a6dba6d33076fbb789442308e57a124 by vmaffione:
monitor: fix cb restore when monitored adapter unregisters

92e8b4a6301cc4ff4481e981c95c5b30b2a44506 by vmaffione:
debug_put_get: don't crash on null pointers

95fc11577d117327e7d99a589e86ba15d0599654 by vmaffione:
netmap: monitor: add missing netmap_adapter_put()

eda82511883f540cd18f8afd2268636c7db97685 by vmaffione:
netmap: pkt-gen: fix ifname before cmp in source_hwaddr

The failed test cases:

3 tests failed.
FAILED:  sys.aio.aio_test.aio_socket_blocking_short_write

Error Message:
Test case body timed out

FAILED:  sys.aio.aio_test.aio_socket_blocking_short_write_vectored

Error Message:
Test case body timed out

FAILED:  sys.aio.aio_test.aio_socket_short_write_cancel

Error Message:
/usr/src/tests/sys/aio/aio_test.c:1396: aio_error(&iocb) == EINPROGRESS not met