FreeBSD-main-amd64-test - Build #22698 - Still unstable

From: <>
Date: Sat, 24 Dec 2022 16:17:28 UTC
FreeBSD-main-amd64-test - Build #22698 (e00774a917503e7e23c469954471c2b519e852c1) - Still unstable

Build information:
Full change log:
Full build log:

Status explanation:
"Unstable" - some tests are suspected being broken by the following changes
"Still Unstable" - the failing test cases have not been fixed by these
                   following changes and this is a notification to note that
                   these changes have not been fully tested by the CI system

Change summaries:
(Those commits are likely but not certainly responsible)

571e5792f96055476b6d91186e5562be7fb2ff84 by ganbold:
Change probe priority so order is correct.

e00774a917503e7e23c469954471c2b519e852c1 by ganbold:
Add support for Rockchip RK3568 SDHCI controller.

The failed test cases:

3 tests failed.
FAILED:  sys.aio.aio_test.aio_socket_blocking_short_write

Error Message:
Test case body timed out

FAILED:  sys.aio.aio_test.aio_socket_blocking_short_write_vectored

Error Message:
Test case body timed out

FAILED:  sys.aio.aio_test.aio_socket_short_write_cancel

Error Message:
/usr/src/tests/sys/aio/aio_test.c:1396: aio_error(&iocb) == EINPROGRESS not met