FreeBSD-main-amd64-test - Build #22700 - Still Unstable

From: <>
Date: Sun, 25 Dec 2022 00:16:35 UTC
FreeBSD-main-amd64-test - Build #22700 (57cc27a3325af74553e852851d5e84e308ae79f4) - Still Unstable

Build information:
Full change log:
Full build log:

Status explanation:
"Unstable" - some tests are suspected being broken by the following changes
"Still Unstable" - the failing test cases have not been fixed by these
                   following changes and this is a notification to note that
                   these changes have not been fully tested by the CI system

Change summaries:
(Those commits are likely but not certainly responsible)

57cc27a3325af74553e852851d5e84e308ae79f4 by tuexen:
BBLog: improve sysctl variables

The failed test cases:

3 tests failed.
FAILED:  sys.aio.aio_test.aio_socket_blocking_short_write

Error Message:
Test case body timed out

FAILED:  sys.aio.aio_test.aio_socket_blocking_short_write_vectored

Error Message:
Test case body timed out

FAILED:  sys.aio.aio_test.aio_socket_short_write_cancel

Error Message:
/usr/src/tests/sys/aio/aio_test.c:1396: aio_error(&iocb) == EINPROGRESS not met