FreeBSD-main-amd64-test - Build #22688 - Still Unstable

From: <>
Date: Thu, 22 Dec 2022 15:14:28 UTC
FreeBSD-main-amd64-test - Build #22688 (5ec1d020bd01a4b803dffb1284595ff2177a7e56) - Still Unstable

Build information:
Full change log:
Full build log:

Status explanation:
"Unstable" - some tests are suspected being broken by the following changes
"Still Unstable" - the failing test cases have not been fixed by these
                   following changes and this is a notification to note that
                   these changes have not been fully tested by the CI system

Change summaries:
(Those commits are likely but not certainly responsible)

e2f3742ab8b10ba5ec4dc190c5b64e9151bb0d57 by rene:
gpioevents: fix some white-space errors

c1a2798faa3d8a76a7b9023d859629b5c0532d9b by jrtc27:
arm64: Don't include td_inhibitors when checking td_ast in do_ast

751d88119fdc1dff71d1390c7768942a9b857bc6 by andrew:
Fix loading the hwpmc module when ACPI is enabled

753c7fc9e6558c9f3197212e661f74c7e83763b0 by andrew:
Fix the SPDX-License-Identifier in CMN-600 files

5ec1d020bd01a4b803dffb1284595ff2177a7e56 by andrew:
Fix the SPDX-License-Identifier in DMC-620 files

The failed test cases:

3 tests failed.
FAILED:  sys.aio.aio_test.aio_socket_blocking_short_write

Error Message:
Test case body timed out

FAILED:  sys.aio.aio_test.aio_socket_blocking_short_write_vectored

Error Message:
Test case body timed out

FAILED:  sys.aio.aio_test.aio_socket_short_write_cancel

Error Message:
/usr/src/tests/sys/aio/aio_test.c:1396: aio_error(&iocb) == EINPROGRESS not met